Target
Proteasome subunit beta type-5
Ligand
BDBM50160868
Substrate
Meas. Tech.
ChEMBL_1567337 (CHEMBL3789477)
IC50
1.6±n/a nM
Citation
 Shi, JLei, MWu, WFeng, HWang, JChen, SZhu, YHu, SLiu, ZJiang, C Design, synthesis and docking studies of novel dipeptidyl boronic acid proteasome inhibitors constructed fromaa- andaß-amino acids. Bioorg Med Chem Lett 26:1958-62 (2016)  
Target
Name:
Proteasome subunit beta type-5
Synonyms:
20S proteasome chymotrypsin-like LMPX PSB5_HUMAN Proteasome Macropain subunit MB1 X
Type:
Protein
Mol. Mass.:
28480.96
Organism:
Homo sapiens (Human)
Description:
Residue:
263
  
Inhibitor
Name:
BDBM50160868
Synonyms:
CHEMBL499504
Type:
Small organic molecule
Emp. Form.:
C25H33BN2O4
Mol. Mass.:
436.352
SMILES:
CC(C)C[C@H](NC(=O)[C@H](Cc1ccccc1)NC(=O)c1cccc2CCCCc12)B(O)O
: