Target
Prostaglandin G/H synthase 1
Ligand
BDBM50161259
Substrate
Meas. Tech.
ChEBML_1566200
IC50
>100000±n/a nM
Citation
 Abdel-Aziz, AAEl-Azab, ASAbou-Zeid, LAElTahir, KEAbdel-Aziz, NIAyyad, RRAl-Obaid, AM Synthesis, anti-inflammatory, analgesic and COX-1/2 inhibition activities of anilides based on 5,5-diphenylimidazolidine-2,4-dione scaffold: Molecular docking studies. Eur J Med Chem 115:121-31 (2016)  
Target
Name:
Prostaglandin G/H synthase 1
Synonyms:
COX1 Cyclooxygenase-1 (COX-1) PTGS1 | Prostaglandin G/H synthase (cyclooxygenase)
Type:
Protein
Mol. Mass.:
68868.60
Organism:
Ovis aries (Sheep)
Description:
Residue:
600
  
Inhibitor
Name:
BDBM50161259
Synonyms:
CHEMBL3785358
Type:
Small organic molecule
Emp. Form.:
C23H20N4O5S
Mol. Mass.:
464.494
SMILES:
NS(=O)(=O)c1ccc(NC(=O)CN2C(=O)NC(C2=O)(c2ccccc2)c2ccccc2)cc1
: