Target
Cyclin-dependent kinase 5 activator 1
Ligand
BDBM50161347
Substrate
Meas. Tech.
ChEMBL_1567129 (CHEMBL3787886)
IC50
25±n/a nM
Citation
 Ouach, ABoulahjar, RVala, CBourg, SBonnet, PGuguen-Guillouzo, CRavache, MLe Guevel, RLozach, OLazar, STroin, YMeijer, LRuchaud, SAkssira, MGuillaumet, GRoutier, S Novel optimization of valmerins (tetrahydropyrido[1,2-a]isoindolones) as potent dual CDK5/GSK3 inhibitors. Eur J Med Chem 115:311-25 (2016)  
Target
Name:
Cyclin-dependent kinase 5 activator 1
Synonyms:
CDK5/p35 Cyclin-dependent kinase 5 regulatory subunit 1 | Cyclin-dependent kinase 5/CDK5 activator 1
Type:
Protein Complex
Mol. Mass.:
Description:
Components:
This complex has 2 components.
Component 1
Name:
Cyclin-dependent kinase 5
Synonyms:
CDK5 CDKN5 Cyclin-dependent kinase 5 (CDK5/ p25) Cyclin-dependent-like kinase 5 PSSALRE Tau protein kinase II catalytic subunit
Type:
Enzyme Subunit
Mol. Mass.:
33308.61
Organism:
Homo sapiens (Human)
Description:
Residue:
292
  
Component 2
Name:
Cyclin-dependent kinase 5 activator 1
Synonyms:
CD5R1_HUMAN CDK5R1 Cyclin-dependent kinase 5 (CDK5/p25) NCK5A p35
Type:
Enzyme Subunit
Mol. Mass.:
34077.43
Organism:
Homo sapiens (Human)
Description:
Q15078
Residue:
307
  
Inhibitor
Name:
BDBM50161347
Synonyms:
CHEMBL3786624
Type:
Small organic molecule
Emp. Form.:
C19H18N4O3
Mol. Mass.:
350.3712
SMILES:
O=Cc1cccc(NC(=O)Nc2cccc3C(=O)N4CCCCC4c23)n1
: