Target
Carbonic anhydrase 2
Ligand
BDBM50161479
Substrate
Meas. Tech.
ChEMBL_1567403 (CHEMBL3789781)
Ki
1.9±n/a nM
Citation
 Özgeris, BGöksu, SPolat Köse, LGülçin, ISalmas, REDurdagi, STümer, FSupuran, CT Acetylcholinesterase and carbonic anhydrase inhibitory properties of novel urea and sulfamide derivatives incorporating dopaminergic 2-aminotetralin scaffolds. Bioorg Med Chem 24:2318-29 (2016)  
Target
Name:
Carbonic anhydrase 2
Synonyms:
CA-II CAC Carbonate dehydratase II Carbonic anhydrase 2 (CA-II) Carbonic anhydrase C Carbonic anhydrase II (CA-II) Carbonic anhydrase II (hCA II) | Carbonic anhydrase isoenzyme II (hCA II)
Type:
Enzyme
Mol. Mass.:
29250.71
Organism:
Homo sapiens (Human)
Description:
P00918
Residue:
260
  
Inhibitor
Name:
BDBM50161479
Synonyms:
CHEMBL3786448
Type:
Small organic molecule
Emp. Form.:
C13H20N2O3S
Mol. Mass.:
284.374
SMILES:
COc1ccc2CCC(Cc2c1)NS(=O)(=O)N(C)C
: