Target
Polyamine deacetylase HDAC10
Ligand
BDBM19149
Substrate
Meas. Tech.
ChEMBL_1572338 (CHEMBL3795921)
IC50
460±n/a nM
Citation
 Cincinelli, RZwick, VMusso, LZuco, VDe Cesare, MZunino, FSimoes-Pires, CNurisso, AGiannini, GCuendet, MDallavalle, S Biphenyl-4-yl-acrylohydroxamic acids: Identification of a novel indolyl-substituted HDAC inhibitor with antitumor activity. Eur J Med Chem 112:99-105 (2016)  
Target
Name:
Polyamine deacetylase HDAC10
Synonyms:
HD10 HDAC10 Histone deacetylase 10 | Human HDAC10
Type:
Chromatin regulator; hydrolase; repressor
Mol. Mass.:
71431.89
Organism:
Homo sapiens (Human)
Description:
Q969S8
Residue:
669
  
Inhibitor
Name:
BDBM19149
Synonyms:
CHEMBL98 SAHA US10188756, Compound SAHA US11505523, Compound SAHA US9353061, SAHA US9695181, Vorinostat Zolinza suberoylanilide hydroxamic acid
Type:
Small organic molecule
Emp. Form.:
C14H20N2O3
Mol. Mass.:
264.3202
SMILES:
ONC(=O)CCCCCCC(=O)Nc1ccccc1
: