Target
Tyrosyl-DNA phosphodiesterase 2
Ligand
BDBM50161959
Substrate
Meas. Tech.
ChEBML_1572461
IC50
>111000±n/a nM
Citation
 Kankanala, JMarchand, CAbdelmalak, MAihara, HPommier, YWang, Z Isoquinoline-1,3-diones as Selective Inhibitors of Tyrosyl DNA Phosphodiesterase II (TDP2). J Med Chem 59:2734-46 (2016)  
Target
Name:
Tyrosyl-DNA phosphodiesterase 2
Synonyms:
EAP2 ETS1-associated protein 2 TDP2 TTRAP Tyr-DNA phosphodiesterase 2 Tyrosyl-DNA phosphodiesterase 2 (hTDP2) VPg unlinkase | hTDP2
Type:
Enzyme Catalytic Domain
Mol. Mass.:
40916.54
Organism:
Homo sapiens (Human)
Description:
gi_23510348
Residue:
362
  
Inhibitor
Name:
BDBM50161959
Synonyms:
CHEMBL3793472
Type:
Small organic molecule
Emp. Form.:
C14H12N4O3
Mol. Mass.:
284.2701
SMILES:
CC(=O)Nc1c2c(CC(=O)NC2=O)nn1-c1ccccc1
: