Target
Branched-chain-amino-acid aminotransferase, mitochondrial
Ligand
BDBM50162302
Substrate
Meas. Tech.
ChEMBL_1570254 (CHEMBL3795165)
IC50
199526±n/a nM
Citation
 Borthwick, JAAncellin, NBertrand, SMBingham, RPCarter, PSChung, CWChurcher, IDodic, NFournier, CFrancis, PLHobbs, AJamieson, CPickett, SDSmith, SESomers, DOSpitzfaden, CSuckling, CJYoung, RJ Structurally Diverse Mitochondrial Branched Chain Aminotransferase (BCATm) Leads with Varying Binding Modes Identified by Fragment Screening. J Med Chem 59:2452-67 (2016)  
Target
Name:
Branched-chain-amino-acid aminotransferase, mitochondrial
Synonyms:
BCAT(m) BCAT2_HUMAN BCATM Branched-chain-amino-acid aminotransferase, mitochondrial PP18 | Placental protein 18
Type:
PROTEIN
Mol. Mass.:
44297.81
Organism:
Homo sapiens (Human)
Description:
ChEMBL_109874
Residue:
392
  
Inhibitor
Name:
BDBM50162302
Synonyms:
CHEMBL3793157
Type:
Small organic molecule
Emp. Form.:
C14H13NO3S
Mol. Mass.:
275.323
SMILES:
CS(=O)(=O)c1ccccc1C(=O)Nc1ccccc1
: