Target
Branched-chain-amino-acid aminotransferase, mitochondrial
Ligand
BDBM50162489
Substrate
Meas. Tech.
ChEMBL_1570254 (CHEMBL3795165)
IC50
7943±n/a nM
Citation
 Borthwick, JAAncellin, NBertrand, SMBingham, RPCarter, PSChung, CWChurcher, IDodic, NFournier, CFrancis, PLHobbs, AJamieson, CPickett, SDSmith, SESomers, DOSpitzfaden, CSuckling, CJYoung, RJ Structurally Diverse Mitochondrial Branched Chain Aminotransferase (BCATm) Leads with Varying Binding Modes Identified by Fragment Screening. J Med Chem 59:2452-67 (2016)  
Target
Name:
Branched-chain-amino-acid aminotransferase, mitochondrial
Synonyms:
BCAT(m) BCAT2_HUMAN BCATM Branched-chain-amino-acid aminotransferase, mitochondrial PP18 | Placental protein 18
Type:
PROTEIN
Mol. Mass.:
44297.81
Organism:
Homo sapiens (Human)
Description:
ChEMBL_109874
Residue:
392
  
Inhibitor
Name:
BDBM50162489
Synonyms:
CHEMBL3794557
Type:
Small organic molecule
Emp. Form.:
C13H14N2O2S
Mol. Mass.:
262.327
SMILES:
CC(C)C(Sc1ncnc2ccccc12)C(O)=O
: