Target
Acetylcholinesterase
Ligand
BDBM50163342
Substrate
Meas. Tech.
ChEMBL_1570830 (CHEMBL3795257)
IC50
1433±n/a nM
Citation
 Si, WZhang, TZhang, LMei, XDong, MZhang, KNing, J Design, synthesis and bioactivity of novel phthalimide derivatives as acetylcholinesterase inhibitors. Bioorg Med Chem Lett 26:2380-2 (2016)  
Target
Name:
Acetylcholinesterase
Synonyms:
ACES_ELEEL Acetylcholinesterase (EeAChE) | ache
Type:
Enzyme
Mol. Mass.:
71812.79
Organism:
Electrophorus electricus (Electric eel)
Description:
Residue:
633
  
Inhibitor
Name:
BDBM50163342
Synonyms:
CHEMBL3794497
Type:
Small organic molecule
Emp. Form.:
C22H24ClN3O2
Mol. Mass.:
397.898
SMILES:
Clc1ccc(CN2CCN(CCCN3C(=O)c4ccccc4C3=O)CC2)cc1
: