Target
Melanin-concentrating hormone receptor 1
Ligand
BDBM50163499
Substrate
Meas. Tech.
ChEMBL_1572290 (CHEMBL3795821)
IC50
90±n/a nM
Citation
 Igawa, HTakahashi, MIkoma, MKaku, HKakegawa, KKina, AAida, JOkuda, SKawata, YNoguchi, THotta, NYamamoto, SNakayama, MNagisa, YKasai, SMaekawa, T Amine-free melanin-concentrating hormone receptor 1 antagonists: Novel non-basic 1-(2H-indazole-5-yl)pyridin-2(1H)-one derivatives and mitigation of mutagenicity in Ames test. Bioorg Med Chem 24:2504-18 (2016)  
Target
Name:
Melanin-concentrating hormone receptor 1
Synonyms:
G-protein coupled receptor 24 MCH receptor 1 MCH-R1 MCHR MCHR1_RAT Melanin Concentrating Hormone 1 Melanin-concentrating hormone receptor 1 Slc1 | Somatostatin receptor-like protein
Type:
Enzyme Catalytic Domain
Mol. Mass.:
39075.64
Organism:
RAT
Description:
Melanin Concentrating Hormone 1 GPR24 RAT::P97639
Residue:
353
  
Inhibitor
Name:
BDBM50163499
Synonyms:
CHEMBL3792893
Type:
Small organic molecule
Emp. Form.:
C20H16F3N3O2S
Mol. Mass.:
419.42
SMILES:
Cc1n(C)nc2ccc(cc12)-n1ccc(OCc2ccc(s2)C(F)(F)F)cc1=O
: