Target
Melanin-concentrating hormone receptor 1
Ligand
BDBM50163508
Substrate
Meas. Tech.
ChEMBL_1572287 (CHEMBL3795818)
IC50
43±n/a nM
Citation
 Igawa, HTakahashi, MIkoma, MKaku, HKakegawa, KKina, AAida, JOkuda, SKawata, YNoguchi, THotta, NYamamoto, SNakayama, MNagisa, YKasai, SMaekawa, T Amine-free melanin-concentrating hormone receptor 1 antagonists: Novel non-basic 1-(2H-indazole-5-yl)pyridin-2(1H)-one derivatives and mitigation of mutagenicity in Ames test. Bioorg Med Chem 24:2504-18 (2016)  
Target
Name:
Melanin-concentrating hormone receptor 1
Synonyms:
G-protein coupled receptor 24 MCH receptor 1 MCH-R1 MCHR-1 MCHR1_HUMAN Melanin-Concentrating Hormone Receptor 1 (MCH1R) Melanin-concentrating hormone receptor 1 (MCH-1) Melanin-concentrating hormone receptor 1 (MCHR-1) SLC-1 Somatostatin receptor-like protein
Type:
G Protein-Coupled Receptor (GPCR)
Mol. Mass.:
45976.27
Organism:
Homo sapiens (Human)
Description:
Membranes from CHO-K1 cells stably expressing human MCH1R were used in assays.
Residue:
422
  
Inhibitor
Name:
BDBM50163508
Synonyms:
CHEMBL3578243
Type:
Small organic molecule
Emp. Form.:
C23H20FN3O2
Mol. Mass.:
389.4222
SMILES:
Cc1n(nc2ccc(cc12)-n1ccc(OCc2ccc(F)cc2)cc1=O)C1CC1
: