Target
Carbonic anhydrase 9
Ligand
BDBM50163860
Substrate
Meas. Tech.
ChEMBL_1572875 (CHEMBL3801011)
Kd
20±n/a nM
Citation
 Talibov, VOLinkuviene, VMatulis, DDanielson, UH Kinetically Selective Inhibitors of Human Carbonic Anhydrase Isozymes I, II, VII, IX, XII, and XIII. J Med Chem 59:2083-93 (2016)  
Target
Name:
Carbonic anhydrase 9
Synonyms:
CA-IX CAH9_HUMAN Carbonic anhydrase 9 (CA IX) Carbonic anhydrase 9 precursor Carbonic anhydrase IX (CAIX) Carbonic anhydrases; II & IX MN RCC-associated antigen G250
Type:
Enzyme
Mol. Mass.:
49669.03
Organism:
Homo sapiens (Human)
Description:
Catalytic domain of human cloned isozyme was used in the assay
Residue:
459
  
Inhibitor
Name:
BDBM50163860
Synonyms:
CHEMBL3797893 | carbonic anhydrase (CA) inhibitors, benzenesulphonamide ligand, 16
Type:
Small organic molecule
Emp. Form.:
C11H12F4N2O2S
Mol. Mass.:
312.284
SMILES:
NS(=O)(=O)c1c(F)c(F)c(N2CCCCC2)c(F)c1F
: