Target
Carbonic anhydrase 12
Ligand
BDBM50163866
Substrate
Meas. Tech.
ChEMBL_1572879 (CHEMBL3801015)
Kd
17±n/a nM
Citation
 Talibov, VOLinkuviene, VMatulis, DDanielson, UH Kinetically Selective Inhibitors of Human Carbonic Anhydrase Isozymes I, II, VII, IX, XII, and XIII. J Med Chem 59:2083-93 (2016)  
Target
Name:
Carbonic anhydrase 12
Synonyms:
CA-XII CAH12_HUMAN Carbonic anhydrase Carbonic anhydrase XII Carbonic anhydrase XII (CAXII) | Tumor antigen HOM-RCC-3.1.3
Type:
Enzyme
Mol. Mass.:
39456.00
Organism:
Homo sapiens (Human)
Description:
Catalytic domain of human cloned isozyme was used in the assay
Residue:
354
  
Inhibitor
Name:
BDBM50163866
Synonyms:
CHEMBL3798473 | carbonic anhydrase (CA) inhibitors, benzenesulphonamide ligand, 15
Type:
Small organic molecule
Emp. Form.:
C18H21F3N2O4S2
Mol. Mass.:
450.496
SMILES:
CC(C)(C)Nc1c(F)c(c(F)c(F)c1S(=O)(=O)CCc1ccccc1)S(N)(=O)=O
: