Target
Adenosine receptor A3
Ligand
BDBM50163878
Substrate
Meas. Tech.
ChEBML_1573812
Ki
396±n/a nM
Citation
 Tosh, DKCiancetta, AWarnick, EO'Connor, RChen, ZGizewski, ECrane, SGao, ZGAuchampach, JASalvemini, DJacobson, KA Purine (N)-Methanocarba Nucleoside Derivatives Lacking an Exocyclic Amine as Selective A3 Adenosine Receptor Agonists. J Med Chem 59:3249-63 (2016)  
Target
Name:
Adenosine receptor A3
Synonyms:
A3AR Adenosine A3 receptor Gpcr2
Type:
PROTEIN
Mol. Mass.:
36460.91
Organism:
Mus musculus
Description:
ChEMBL_1515686
Residue:
319
  
Inhibitor
Name:
BDBM50163878
Synonyms:
CHEMBL3799738
Type:
Small organic molecule
Emp. Form.:
C19H16ClN5O3S
Mol. Mass.:
429.88
SMILES:
[H][C@]12C[C@]1([C@@H](O)[C@@H](O)[C@@H]2n1cnc2cnc(nc12)C#Cc1ccc(Cl)s1)C(=O)NC
: