Target
Glutamate receptor ionotropic, NMDA 1/2A
Ligand
BDBM50164398
Substrate
Meas. Tech.
ChEMBL_1574105 (CHEMBL3801515)
EC50
21±n/a nM
Citation
 Volgraf, MSellers, BDJiang, YWu, GLy, CQVillemure, EPastor, RMYuen, PWLu, ALuo, XLiu, MZhang, SSun, LFu, YLupardus, PJWallweber, HJLiederer, BMDeshmukh, GPlise, ETay, SReynen, PHerrington, JGustafson, ALiu, YDirksen, ADietz, MGLiu, YWang, TMHanson, JEHackos, DScearce-Levie, KSchwarz, JB Discovery of GluN2A-Selective NMDA Receptor Positive Allosteric Modulators (PAMs): Tuning Deactivation Kinetics via Structure-Based Design. J Med Chem 59:2760-79 (2016)  
Target
Name:
Glutamate receptor ionotropic, NMDA 1/2A
Synonyms:
Glutamate NMDA receptor; GRIN1/GRIN2A NR1/NR2A
Type:
Protein
Mol. Mass.:
Description:
Components:
This complex has 2 components.
Component 1
Name:
Glutamate receptor ionotropic, NMDA 1
Synonyms:
GRIN1 Glutamate [NMDA] receptor subunit zeta-1 N-methyl-D-aspartate receptor subunit NR1 NMDZ1_HUMAN | phencyclidine
Type:
Enzyme Catalytic Domain
Mol. Mass.:
105397.81
Organism:
Homo sapiens (Human)
Description:
Q05586
Residue:
938
  
Component 2
Name:
Glutamate receptor ionotropic, NMDA 2A
Synonyms:
GRIN2A Glutamate [NMDA] receptor Glutamate [NMDA] receptor subunit epsilon-1 NMDA receptor subtype 2A protein (NR2A) NMDE1_HUMAN hNR2A
Type:
Mol. Mass.:
165293.76
Organism:
Homo sapiens (Human)
Description:
Residue:
1464
  
Inhibitor
Name:
BDBM50164398
Synonyms:
CHEMBL3799213
Type:
Small organic molecule
Emp. Form.:
C16H8ClF6N5OS
Mol. Mass.:
467.776
SMILES:
FC(F)(F)c1cc(Cl)n(Cc2cc(=O)n3c([C@@H]4C[C@H]4C#N)c(sc3n2)C(F)(F)F)n1
: