Target
Alpha-1D adrenergic receptor
Ligand
BDBM50164745
Substrate
Meas. Tech.
ChEMBL_1575788 (CHEMBL3801620)
Ki
0.860000±n/a nM
Citation
 Sakauchi, NKohara, YSato, ASuzaki, TImai, YOkabe, YImai, SSaikawa, RNagabukuro, HKuno, HFujita, HKamo, IYoshida, M Discovery of 5-Chloro-1-(5-chloro-2-(methylsulfonyl)benzyl)-2-imino-1,2-dihydropyridine-3-carboxamide (TAK-259) as a Novel, Selective, and Orally Activea1D Adrenoceptor Antagonist with Antiurinary Frequency Effects: Reducing Human Ether-a-go-go-Related Gene (hERG) Liabilities. J Med Chem 59:2989-3002 (2016)  
Target
Name:
Alpha-1D adrenergic receptor
Synonyms:
ADA1D_HUMAN ADRA1D Adrenergic receptor alpha Alpha 1D-adrenoreceptor Alpha-1D adrenoceptor adrenergic Alpha1D
Type:
Enzyme Catalytic Domain
Mol. Mass.:
60485.82
Organism:
Homo sapiens (Human)
Description:
adrenergic Alpha1D ADRA1D HUMAN::P25100
Residue:
572
  
Inhibitor
Name:
BDBM50164745
Synonyms:
CHEMBL3800606
Type:
Small organic molecule
Emp. Form.:
C14H10Cl2N4O
Mol. Mass.:
321.161
SMILES:
NC(=O)c1cc(Cl)cn(Cc2cc(Cl)cc(c2)C#N)c1=N
: