Target
Melanocyte-stimulating hormone receptor
Ligand
BDBM50115362
Substrate
Meas. Tech.
ChEMBL_1576041 (CHEMBL3803373)
IC50
1630±n/a nM
Citation
 Lensing, CJFreeman, KTSchnell, SMAdank, DNSpeth, RCHaskell-Luevano, C An in Vitro and in Vivo Investigation of Bivalent Ligands That Display Preferential Binding and Functional Activity for Different Melanocortin Receptor Homodimers. J Med Chem 59:3112-28 (2016)  
Target
Name:
Melanocyte-stimulating hormone receptor
Synonyms:
MC1-R Mc1r Melanocyte-stimulating hormone receptor | Msh-r
Type:
PROTEIN
Mol. Mass.:
35238.60
Organism:
Mus musculus
Description:
ChEMBL_1498846
Residue:
315
  
Inhibitor
Name:
BDBM50115362
Synonyms:
2-{2-[2-Acetylamino-3-(3H-imidazol-4-yl)-propionylamino]-3-naphthalen-2-yl-propionylamino}-5-guanidino-pentanoic acid [1-carbamoyl-2-(1H-indol-3-yl)-ethyl]-amide | CHEMBL103817
Type:
Small organic molecule
Emp. Form.:
C38H45N11O5
Mol. Mass.:
735.8346
SMILES:
CC(=O)N[C@@H](Cc1cnc[nH]1)C(=O)N[C@H](Cc1ccc2ccccc2c1)C(=O)N[C@@H](CCCNC(N)=N)C(=O)N[C@@H](Cc1c[nH]c2ccccc12)C(N)=O
: