Target
Melanocortin receptor 3
Ligand
BDBM50029747
Substrate
Meas. Tech.
ChEMBL_1576048 (CHEMBL3803380)
EC50
0.760000±n/a nM
Citation
 Lensing, CJFreeman, KTSchnell, SMAdank, DNSpeth, RCHaskell-Luevano, C An in Vitro and in Vivo Investigation of Bivalent Ligands That Display Preferential Binding and Functional Activity for Different Melanocortin Receptor Homodimers. J Med Chem 59:3112-28 (2016)  
Target
Name:
Melanocortin receptor 3
Synonyms:
MC3-R Mc3r
Type:
PROTEIN
Mol. Mass.:
35808.24
Organism:
Mus musculus
Description:
ChEMBL_1498848
Residue:
323
  
Inhibitor
Name:
BDBM50029747
Synonyms:
(4S)-4-{[(1S)-1-{[(1S)-1-{[(1S)-1-{[(1S)-1-[({[(2S)-6-amino-1-[(2S)-2-{[(1S)-1-carbamoyl-2-methylpropyl]carbamoyl}pyrrolidin-1-yl]-1-oxohexan-2-yl]carbamoyl}methyl)carbamoyl]-2-(1H-indol-3-yl)ethyl]carbamoyl}-4-carbamimidamidobutyl]carbamoyl}-2-phenylethyl]carbamoyl}-2-(1H-imidazol-5-yl)ethyl]carbamoyl}-4-[(2S)-2-[(2S)-2-[(2S)-2-[(2S)-2-acetamido-3-hydroxypropanamido]-3-(4-hydroxyphenyl)propanamido]-3-hydroxypropanamido]-4-(methylsulfanyl)butanamido]butanoic acid Ac-S-Y-S-M-E-H-F-R-W-G-K-P-V-NH2 Ac-Ser-Tyr-Nle-Glu-His-D-Phe-Arg-Trp-Gly-Lys-Pro-Val-NH2 Ac-Ser-Tyr-Ser-Met-Glu-His-Phe-Arg-Trp-Gly-Lys-Pro-Val-NH2(alpha-MSH) Ac-Ser-Tyr-Ser-Met-Glu-His6-Phe7-Arg8-Trp9-Gly-Lys-Pro-Val-NH2 CHEMBL214332 alpha-MSH; Ac-Ser-Tyr-Ser-Met-Glu-His-DPhe-Arg-Trp-Gly-Lys-Pro-Val-NH2
Type:
Small organic molecule
Emp. Form.:
C77H109N21O19S
Mol. Mass.:
1664.884
SMILES:
CSCC[C@H](NC(=O)[C@H](CO)NC(=O)[C@H](Cc1ccc(O)cc1)NC(=O)[C@H](CO)NC(C)=O)C(=O)N[C@@H](CCC(O)=O)C(=O)N[C@@H](Cc1cnc[nH]1)C(=O)N[C@@H](Cc1ccccc1)C(=O)N[C@@H](CCCNC(N)=N)C(=O)N[C@@H](Cc1c[nH]c2ccccc12)C(=O)NCC(=O)N[C@@H](CCCCN)C(=O)N1CCC[C@H]1C(=O)N[C@@H](C(C)C)C(N)=O
: