Target
Sphingosine 1-phosphate receptor 3
Ligand
BDBM50164823
Substrate
Meas. Tech.
ChEMBL_1576116 (CHEMBL3804200)
EC50
22±n/a nM
Citation
 Bolli, MHLescop, CBirker, Mde Kanter, RHess, PKohl, CNayler, ORey, MSieber, PVelker, JWeller, TSteiner, B Novel S1P1 receptor agonists - Part 5: From amino-to alkoxy-pyridines. Eur J Med Chem 115:326-41 (2016)  
Target
Name:
Sphingosine 1-phosphate receptor 3
Synonyms:
C9orf108 EDG3 S1P receptor 3 S1P3 S1PR3_HUMAN Sphingosine 1-phosphate receptor 3 (S1P3) | Sphingosine 1-phosphate receptor Edg-3
Type:
G Protein-Coupled Receptor (GPCR)
Mol. Mass.:
42278.13
Organism:
Homo sapiens (Human)
Description:
Q99500
Residue:
378
  
Inhibitor
Name:
BDBM50164823
Synonyms:
CHEMBL3800133
Type:
Small organic molecule
Emp. Form.:
C26H32N4O6
Mol. Mass.:
496.5555
SMILES:
CCc1cc(cc(C)c1OC[C@@H](O)CNC(=O)CO)-c1noc(n1)-c1cc(OC)nc(c1)C1CCC1
: