Target
Calmodulin
Ligand
BDBM50017723
Substrate
Meas. Tech.
ChEMBL_1572741 (CHEMBL3804250)
EC50
2400±n/a nM
Citation
 Bruno, CCavalluzzi, MMRusciano, MRLovece, ACarrieri, APracella, RGiannuzzi, GPolimeno, LViale, MIllario, MFranchini, CLentini, G The chemosensitizing agent lubeluzole binds calmodulin and inhibits Ca(2+)/calmodulin-dependent kinase II. Eur J Med Chem 116:36-45 (2016)  
Target
Name:
Calmodulin
Synonyms:
CALM CAM
Type:
PROTEIN
Mol. Mass.:
16813.73
Organism:
Bos taurus
Description:
ChEMBL_1458985
Residue:
149
  
Inhibitor
Name:
BDBM50017723
Synonyms:
(3,3-Diphenyl-propyl)-(1-methyl-2-phenyl-ethyl)-amine Prenylamine | Prenylamine(3,3-Diphenyl-propyl)-(1-methyl-2-phenyl-ethyl)-amine
Type:
Small organic molecule
Emp. Form.:
C24H27N
Mol. Mass.:
329.4779
SMILES:
CC(Cc1ccccc1)NCCC(c1ccccc1)c1ccccc1
: