Target
5'-nucleotidase
Ligand
BDBM50165146
Substrate
Meas. Tech.
ChEMBL_1572756 (CHEMBL3804265)
Ki
172±n/a nM
Citation
 al-Rashida, MBatool, GSattar, AEjaz, SAKhan, SLecka, JSévigny, JHameed, AIqbal, J 2-Alkoxy-3-(sulfonylarylaminomethylene)-chroman-4-ones as potent and selective inhibitors of ectonucleotidases. Eur J Med Chem 115:484-94 (2016)  
Target
Name:
5'-nucleotidase
Synonyms:
5'-nucleotidase Ecto-5'-nucleotidase (e5'NT) NT Nt5e | Nte
Type:
Enzyme
Mol. Mass.:
63971.44
Organism:
Rattus norvegicus (Rat)
Description:
P21588
Residue:
576
  
Inhibitor
Name:
BDBM50165146
Synonyms:
CHEMBL3798795
Type:
Small organic molecule
Emp. Form.:
C20H22N2O5S
Mol. Mass.:
402.464
SMILES:
CCCCOC1Oc2ccccc2C(=O)\C1=C/Nc1cccc(c1)S(N)(=O)=O
: