Target
5'-nucleotidase
Ligand
BDBM50165147
Substrate
Meas. Tech.
ChEMBL_1572755 (CHEMBL3804264)
IC50
380±n/a nM
Citation
 al-Rashida, MBatool, GSattar, AEjaz, SAKhan, SLecka, JSévigny, JHameed, AIqbal, J 2-Alkoxy-3-(sulfonylarylaminomethylene)-chroman-4-ones as potent and selective inhibitors of ectonucleotidases. Eur J Med Chem 115:484-94 (2016)  
Target
Name:
5'-nucleotidase
Synonyms:
5'-NT 5NTD_HUMAN Ecto-5'-nucleotidase NT5 NTE
Type:
Enzyme
Mol. Mass.:
63371.54
Organism:
Homo sapiens (Human)
Description:
P21589
Residue:
574
  
Inhibitor
Name:
BDBM50165147
Synonyms:
CHEMBL3797302
Type:
Small organic molecule
Emp. Form.:
C17H16N2O5S
Mol. Mass.:
360.384
SMILES:
COC1Oc2ccccc2C(=O)\C1=C/Nc1cccc(c1)S(N)(=O)=O
: