Target
Growth hormone secretagogue receptor type 1
Ligand
BDBM50165580
Substrate
Meas. Tech.
ChEMBL_1574210 (CHEMBL3802215)
EC50
82±n/a nM
Citation
 Maingot, MBlayo, ALDenoyelle, SM'Kadmi, CDamian, MMary, SGagne, DSanchez, PAicher, BSchmidt, PMüller, GTeifel, MGünther, EMarie, JBanères, JLMartinez, JFehrentz, JA New ligands of the ghrelin receptor based on the 1,2,4-triazole scaffold by introduction of a second chiral center. Bioorg Med Chem Lett 26:2408-12 (2016)  
Target
Name:
Growth hormone secretagogue receptor type 1
Synonyms:
GH-releasing peptide receptor GHS-R GHSR_HUMAN Ghrelin receptor | Ghrelin receptor 1a (GHS-R1a)
Type:
Receptor
Mol. Mass.:
41334.57
Organism:
Homo sapiens (Human)
Description:
Receptor binding studies use plasma membranes from LLC PK-1 cells transiently transfected with hGHSR1a.
Residue:
366
  
Inhibitor
Name:
BDBM50165580
Synonyms:
CHEMBL3798337
Type:
Small organic molecule
Emp. Form.:
C50H66N10O6
Mol. Mass.:
903.1224
SMILES:
COC(=O)[C@H](CC(C)C)NC(=O)C(CC(C)C)C(=O)N[C@H](Cc1c[nH]c2ccccc12)c1nnc([C@@H](Cc2c[nH]c3ccccc23)NC(=O)[C@@H](N)CCCCN)n1Cc1ccc(OC)cc1
: