Target
Serine/threonine-protein kinase B-raf
Ligand
BDBM50165864
Substrate
Meas. Tech.
ChEMBL_1574500 (CHEMBL3804126)
IC50
4.0±n/a nM
Citation
 Liu, LLee, MRKim, JLWhittington, DABregman, HHua, ZLewis, RTMartin, MWNishimura, NPotashman, MYang, KYi, SVaida, KREpstein, LFBabij, CFernando, MCarnahan, JNorman, MH Purinylpyridinylamino-based DFG-in/aC-helix-out B-Raf inhibitors: Applying mutant versus wild-type B-Raf selectivity indices for compound profiling. Bioorg Med Chem 24:2215-34 (2016)  
Target
Name:
Serine/threonine-protein kinase B-raf
Synonyms:
B-RAF B-Raf proto-oncogene serine/threonine-protein kinase BRAF1 RAFB1 v-Raf murine sarcoma viral oncogene homolog B1
Type:
Serine/threonine-protein kinase
Mol. Mass.:
84446.00
Organism:
Homo sapiens (Human)
Description:
P15056
Residue:
766
  
Inhibitor
Name:
BDBM50165864
Synonyms:
CHEMBL3799014
Type:
Small organic molecule
Emp. Form.:
C22H14F3N7O2S
Mol. Mass.:
497.452
SMILES:
Fc1cccc(c1)S(=O)(=O)Nc1ccc(F)c(Nc2ncccc2-c2ncnc3[nH]cnc23)c1F
: