Target
Fibroblast growth factor receptor 1
Ligand
BDBM50065454
Substrate
Meas. Tech.
ChEMBL_1572803 (CHEMBL3804527)
IC50
33±n/a nM
Citation
 Fan, JDai, YShao, JPeng, XWang, CCao, SZhao, BAi, JGeng, MDuan, W Design, synthesis and biological evaluation of pyrazolylaminoquinazoline derivatives as highly potent pan-fibroblast growth factor receptor inhibitors. Bioorg Med Chem Lett 26:2594-9 (2016)  
Target
Name:
Fibroblast growth factor receptor 1
Synonyms:
BFGFR Basic fibroblast growth factor receptor 1 (FGFR1) CEK FGFR-1 FGFR-1, (FL) FGFR1_HUMAN FLT2 Fibroblast growth factor receptor 1 (FGFR-1) Fms-like tyrosine kinase 2 N-sam bFGF-R | c-fgr
Type:
Receptor
Mol. Mass.:
91861.70
Organism:
Homo sapiens (Human)
Description:
P11362
Residue:
822
  
Inhibitor
Name:
BDBM50065454
Synonyms:
CHEBI:63453 | CHEMBL3348846
Type:
Small organic molecule
Emp. Form.:
C26H33N5O3
Mol. Mass.:
463.5719
SMILES:
COc1cc(CCc2cc(NC(=O)c3ccc(cc3)N3C[C@H](C)N[C@H](C)C3)n[nH]2)cc(OC)c1
: