Target
Fibroblast growth factor receptor 2
Ligand
BDBM50166840
Substrate
Meas. Tech.
ChEMBL_1572613 (CHEMBL3803146)
IC50
0.800000±n/a nM
Citation
 Fan, JDai, YShao, JPeng, XWang, CCao, SZhao, BAi, JGeng, MDuan, W Design, synthesis and biological evaluation of pyrazolylaminoquinazoline derivatives as highly potent pan-fibroblast growth factor receptor inhibitors. Bioorg Med Chem Lett 26:2594-9 (2016)  
Target
Name:
Fibroblast growth factor receptor 2
Synonyms:
BEK FGFR-2 FGFR2 Fibroblast growth factor receptor 2 (FGFR2) KGFR Keratinocyte growth factor receptor VEGF-receptor 2 and Fibroblast growth factor receptor 2
Type:
Enzyme
Mol. Mass.:
92015.45
Organism:
Homo sapiens (Human)
Description:
P21802
Residue:
821
  
Inhibitor
Name:
BDBM50166840
Synonyms:
CHEMBL3798997
Type:
Small organic molecule
Emp. Form.:
C27H33N7O2
Mol. Mass.:
487.5966
SMILES:
CCN1CCN(CC1)c1ccc2c(Nc3cc(CCc4cc(OC)cc(OC)c4)[nH]n3)ncnc2c1
: