Target
Fatty-acid amide hydrolase 1
Ligand
BDBM50166911
Substrate
Meas. Tech.
ChEMBL_1573063 (CHEMBL3802167)
IC50
0.200000±n/a nM
Citation
 Pember, SOMejia, GLPrice, TJPasteris, RJ Piperidinyl thiazole isoxazolines: A new series of highly potent, slowly reversible FAAH inhibitors with analgesic properties. Bioorg Med Chem Lett 26:2965-2973 (2016)  
Target
Name:
Fatty-acid amide hydrolase 1
Synonyms:
Anandamide amidohydrolase FAAH FAAH1_HUMAN Fatty-acid amide hydrolase (FAAH) Oleamide hydrolase 1
Type:
Protein
Mol. Mass.:
63071.19
Organism:
Homo sapiens (Human)
Description:
O00519
Residue:
579
  
Inhibitor
Name:
BDBM50166911
Synonyms:
CHEMBL3799516
Type:
Small organic molecule
Emp. Form.:
C23H21N5O5S
Mol. Mass.:
479.508
SMILES:
[O-][N+](=O)c1ccc(OC(=O)N2CCN(CC2)c2nc(cs2)C2=NOC(C2)c2ccccc2)cc1
: