Target
Fatty-acid amide hydrolase 1
Ligand
BDBM50166877
Substrate
Meas. Tech.
ChEMBL_1573065 (CHEMBL3802169)
Ki
0.056000±n/a nM
Citation
 Pember, SOMejia, GLPrice, TJPasteris, RJ Piperidinyl thiazole isoxazolines: A new series of highly potent, slowly reversible FAAH inhibitors with analgesic properties. Bioorg Med Chem Lett 26:2965-2973 (2016)  
Target
Name:
Fatty-acid amide hydrolase 1
Synonyms:
Anandamide amidohydrolase FAAH FAAH1_HUMAN Fatty-acid amide hydrolase (FAAH) Oleamide hydrolase 1
Type:
Protein
Mol. Mass.:
63071.19
Organism:
Homo sapiens (Human)
Description:
O00519
Residue:
579
  
Inhibitor
Name:
BDBM50166877
Synonyms:
CHEMBL3798594
Type:
Small organic molecule
Emp. Form.:
C25H25N3O3S
Mol. Mass.:
447.549
SMILES:
Cc1cccc(OC(=O)N2CCC(CC2)c2nc(cs2)C2=NOC(C2)c2ccccc2)c1
: