Target
Fatty-acid amide hydrolase 1
Ligand
BDBM50166891
Substrate
Meas. Tech.
ChEMBL_1573063 (CHEMBL3802167)
Ki
0.019±n/a nM
Citation
 Pember, SOMejia, GLPrice, TJPasteris, RJ Piperidinyl thiazole isoxazolines: A new series of highly potent, slowly reversible FAAH inhibitors with analgesic properties. Bioorg Med Chem Lett 26:2965-2973 (2016)  
Target
Name:
Fatty-acid amide hydrolase 1
Synonyms:
Anandamide amidohydrolase FAAH FAAH1_HUMAN Fatty-acid amide hydrolase (FAAH) Oleamide hydrolase 1
Type:
Protein
Mol. Mass.:
63071.19
Organism:
Homo sapiens (Human)
Description:
O00519
Residue:
579
  
Inhibitor
Name:
BDBM50166891
Synonyms:
CHEMBL3799008
Type:
Small organic molecule
Emp. Form.:
C24H21N5O3S
Mol. Mass.:
459.52
SMILES:
O=C(Oc1cccc(c1)C#N)N1CCN(CC1)c1nc(cs1)C1=NOC(C1)c1ccccc1
: