Target
Metabotropic glutamate receptor 4
Ligand
BDBM50166956
Substrate
Meas. Tech.
ChEMBL_1573310 (CHEMBL3804042)
EC50
0.065000±n/a nM
Citation
 Gogliotti, RDEngers, DWGarcia-Barrantes, PMPanarese, JDGentry, PRBlobaum, ALMorrison, RDDaniels, JSThompson, ADJones, CKConn, PJNiswender, CMLindsley, CWHopkins, CR Discovery of 3-aminopicolinamides as metabotropic glutamate receptor subtype 4 (mGlu4) positive allosteric modulator warheads engendering CNS exposure and in vivo efficacy. Bioorg Med Chem Lett 26:2915-2919 (2016)  
Target
Name:
Metabotropic glutamate receptor 4
Synonyms:
GPRC1D GRM4_HUMAN MGLUR4 Metabotropic glutamate receptor 4 (mGlu4) metabotropic glutamate 4
Type:
Protein
Mol. Mass.:
101899.95
Organism:
Homo sapiens (Human)
Description:
Q14833
Residue:
912
  
Inhibitor
Name:
BDBM50166956
Synonyms:
CHEMBL3798517
Type:
Small organic molecule
Emp. Form.:
C18H16ClN5O2
Mol. Mass.:
369.805
SMILES:
CCc1cnc(Oc2ccc(NC(=O)c3ncccc3N)cc2Cl)nc1
: