Target
Metabotropic glutamate receptor 4
Ligand
BDBM50166968
Substrate
Meas. Tech.
ChEMBL_1573312 (CHEMBL3804044)
EC50
128±n/a nM
Citation
 Gogliotti, RDEngers, DWGarcia-Barrantes, PMPanarese, JDGentry, PRBlobaum, ALMorrison, RDDaniels, JSThompson, ADJones, CKConn, PJNiswender, CMLindsley, CWHopkins, CR Discovery of 3-aminopicolinamides as metabotropic glutamate receptor subtype 4 (mGlu4) positive allosteric modulator warheads engendering CNS exposure and in vivo efficacy. Bioorg Med Chem Lett 26:2915-2919 (2016)  
Target
Name:
Metabotropic glutamate receptor 4
Synonyms:
GRM4_RAT Grm4 Metabotropic glutamate receptor 4 (mGlu4) mGlu4 metabotropic glutamate 4a
Type:
Enzyme
Mol. Mass.:
101849.79
Organism:
Rattus norvegicus (Rat)
Description:
P31423
Residue:
912
  
Inhibitor
Name:
BDBM50166968
Synonyms:
CHEMBL3798234
Type:
Small organic molecule
Emp. Form.:
C20H13ClN4O3
Mol. Mass.:
392.795
SMILES:
Nc1cccnc1C(=O)Nc1ccc(N2C(=O)c3ccccc3C2=O)c(Cl)c1
: