Target
Tryptophan 5-hydroxylase 1
Ligand
BDBM50167379
Substrate
Meas. Tech.
ChEBML_1574259
IC50
501±n/a nM
Citation
 Goldberg, DRDe Lombaert, SAiello, RBourassa, PBarucci, NZhang, QParalkar, VStein, AJValentine, JZavadoski, W Discovery of acyl guanidine tryptophan hydroxylase-1 inhibitors. Bioorg Med Chem Lett 26:2855-2860 (2016)  
Target
Name:
Tryptophan 5-hydroxylase 1
Synonyms:
TPH TPH1_HUMAN TRPH | Tryptophan 5-monooxygenase 1
Type:
PROTEIN
Mol. Mass.:
50990.64
Organism:
Homo sapiens (Human)
Description:
ChEMBL_1361824
Residue:
444
  
Inhibitor
Name:
BDBM50167379
Synonyms:
CHEMBL3797650
Type:
Small organic molecule
Emp. Form.:
C21H22N6O3
Mol. Mass.:
406.4378
SMILES:
N[C@@H](Cc1ccc(cc1)C(=O)\N=C(/N)NCc1ccccc1-n1cccn1)C(O)=O
: