Target
Tryptophan 5-hydroxylase 1
Ligand
BDBM50167821
Substrate
Meas. Tech.
ChEMBL_1574259 (CHEMBL3802442)
IC50
15±n/a nM
Citation
 Goldberg, DRDe Lombaert, SAiello, RBourassa, PBarucci, NZhang, QParalkar, VStein, AJValentine, JZavadoski, W Discovery of acyl guanidine tryptophan hydroxylase-1 inhibitors. Bioorg Med Chem Lett 26:2855-2860 (2016)  
Target
Name:
Tryptophan 5-hydroxylase 1
Synonyms:
TPH TPH1_HUMAN TRPH | Tryptophan 5-monooxygenase 1
Type:
PROTEIN
Mol. Mass.:
50990.64
Organism:
Homo sapiens (Human)
Description:
ChEMBL_1361824
Residue:
444
  
Inhibitor
Name:
BDBM50167821
Synonyms:
CHEMBL3797220
Type:
Small organic molecule
Emp. Form.:
C24H31N5O3
Mol. Mass.:
437.5346
SMILES:
CC1CCCCN1c1ccccc1CN\C(N)=N\C(=O)c1ccc(C[C@H](N)C(O)=O)cc1
: