Target
Kallikrein-7
Ligand
BDBM50167828
Substrate
Meas. Tech.
ChEMBL_1574274 (CHEMBL3802457)
Ki
12200±n/a nM
Citation
 Saeed, A Isocoumarins, miraculous natural products blessed with diverse pharmacological activities. Eur J Med Chem 116:290-317 (2016)  
Target
Name:
Kallikrein-7
Synonyms:
KLK7 Kallikrein 7 PRSS6 Serine protease 6 hK7 kallikrein-7 isoform 1 preproprotein
Type:
PROTEIN
Mol. Mass.:
27535.05
Organism:
Homo sapiens (Human)
Description:
ChEMBL_1469257
Residue:
253
  
Inhibitor
Name:
BDBM50167828
Synonyms:
CHEMBL3798972
Type:
Small organic molecule
Emp. Form.:
C30H22O13
Mol. Mass.:
590.4879
SMILES:
COC1=C(C(=O)c2c(O)c3C(=O)O[C@@H](C)Cc3c(O)c2C1=O)c1c(O)c2C(=O)C3=C(C[C@H](C)OC3=O)C(=O)c2cc1OC
: