Target
Microtubule-associated protein 2
Ligand
BDBM50099398
Substrate
Meas. Tech.
ChEMBL_1574297 (CHEMBL3802682)
IC50
37000±n/a nM
Citation
 Cheruvallath, ZTang, MMcBride, CKomandla, MMiura, JTon-Nu, TErikson, PFeng, JFarrell, PLawson, JDVanderpool, DWu, YDougan, DRPlonowski, AHolub, CLarson, C Discovery of potent, reversible MetAP2 inhibitors via fragment based drug discovery and structure based drug design-Part 1. Bioorg Med Chem Lett 26:2774-2778 (2016)  
Target
Name:
Microtubule-associated protein 2
Synonyms:
MAP-2 MTAP2_HUMAN
Type:
PROTEIN
Mol. Mass.:
199423.64
Organism:
Homo sapiens (Human)
Description:
ChEMBL_107603
Residue:
1827
  
Inhibitor
Name:
BDBM50099398
Synonyms:
5-Bromo-1H-indazole cid_761929
Type:
Small organic molecule
Emp. Form.:
C7H5BrN2
Mol. Mass.:
197.032
SMILES:
Brc1ccc2[nH]ncc2c1
: