Target
Microtubule-associated protein 2
Ligand
BDBM50167928
Substrate
Meas. Tech.
ChEMBL_1574308 (CHEMBL3802693)
EC50
770±n/a nM
Citation
 Cheruvallath, ZTang, MMcBride, CKomandla, MMiura, JTon-Nu, TErikson, PFeng, JFarrell, PLawson, JDVanderpool, DWu, YDougan, DRPlonowski, AHolub, CLarson, C Discovery of potent, reversible MetAP2 inhibitors via fragment based drug discovery and structure based drug design-Part 1. Bioorg Med Chem Lett 26:2774-2778 (2016)  
Target
Name:
Microtubule-associated protein 2
Synonyms:
MAP-2 MTAP2_HUMAN
Type:
PROTEIN
Mol. Mass.:
199423.64
Organism:
Homo sapiens (Human)
Description:
ChEMBL_107603
Residue:
1827
  
Inhibitor
Name:
BDBM50167928
Synonyms:
CHEMBL3797699
Type:
Small organic molecule
Emp. Form.:
C17H15F3N4O2
Mol. Mass.:
364.3218
SMILES:
Cc1cc(ncc1-c1cc(cc2[nH]ncc12)C(F)(F)F)C(=O)NCCO
: