Target
Aldo-keto reductase family 1 member B1
Ligand
BDBM50167989
Substrate
Meas. Tech.
ChEMBL_1574573 (CHEMBL3800856)
IC50
9400±n/a nM
Citation
 Zhu, SHao, XZhang, SQin, XChen, XZhu, C Synthesis of benzothiadiazine derivatives exhibiting dual activity as aldose reductase inhibitors and antioxidant agents. Bioorg Med Chem Lett 26:2880-2885 (2016)  
Target
Name:
Aldo-keto reductase family 1 member B1
Synonyms:
ALDR_RAT Akr1b4 Aldr1
Type:
PROTEIN
Mol. Mass.:
35797.87
Organism:
Rattus norvegicus
Description:
ChEMBL_1512484
Residue:
316
  
Inhibitor
Name:
BDBM50167989
Synonyms:
CHEMBL3798264
Type:
Small organic molecule
Emp. Form.:
C16H16N2O5S
Mol. Mass.:
348.374
SMILES:
OC(=O)CN1CN(Cc2ccccc2)S(=O)(=O)c2cc(O)ccc12
: