Target
Pancreatic triacylglycerol lipase
Ligand
BDBM50168019
Substrate
Meas. Tech.
ChEMBL_1575199 (CHEMBL3800919)
IC50
710±n/a nM
Citation
 Ha, MTTran, MHAh, KJJo, KJKim, JKim, WDCheon, WJWoo, MHRyu, SHMin, BS Potential pancreatic lipase inhibitory activity of phenolic constituents from the root bark of Morus alba L. Bioorg Med Chem Lett 26:2788-2794 (2016)  
Target
Name:
Pancreatic triacylglycerol lipase
Synonyms:
LIPP_PIG PNLIP Pancreatic lipase | Pancreatic triacylglycerol lipase
Type:
Enzyme
Mol. Mass.:
50080.69
Organism:
Sus scrofa (Pig)
Description:
P00591
Residue:
450
  
Inhibitor
Name:
BDBM50168019
Synonyms:
CHEMBL3798170
Type:
Small organic molecule
Emp. Form.:
C30H36O6
Mol. Mass.:
492.6032
SMILES:
[#6]\[#6](-[#6])=[#6]\[#6]-[#6]\[#6](-[#6])=[#6]/[#6]-c1c(-[#8])cc2-[#8]-[#6@@H](-[#6]-[#6](=O)-c2c1-[#8])-c1ccc(-[#8])c(-[#6]\[#6]=[#6](\[#6])-[#6])c1-[#8]
: