Target
NAD-dependent protein deacetylase sirtuin-2
Ligand
BDBM50168844
Substrate
Meas. Tech.
ChEMBL_1577526 (CHEMBL3806935)
IC50
102±n/a nM
Citation
 Ai, TWilson, DJMore, SSXie, JChen, L 5-((3-Amidobenzyl)oxy)nicotinamides as Sirtuin 2 Inhibitors. J Med Chem 59:2928-41 (2016)  
Target
Name:
NAD-dependent protein deacetylase sirtuin-2
Synonyms:
NAD-Dependent Deacetylase Sirtuin-2 NAD-dependent deacetylase sirtuin 3 SIR2-like SIR2L SIR2_HUMAN Sirtuin 2 (SIRT2)
Type:
Hydrolase
Mol. Mass.:
43172.62
Organism:
Homo sapiens (Human)
Description:
Residue:
389
  
Inhibitor
Name:
BDBM50168844
Synonyms:
CHEMBL3805267
Type:
Small organic molecule
Emp. Form.:
C22H19N3O5
Mol. Mass.:
405.4034
SMILES:
COC(=O)c1ccc(cc1)C(=O)Nc1cccc(COc2cncc(c2)C(N)=O)c1
: