Target
NAD-dependent protein deacetylase sirtuin-2
Ligand
BDBM50168736
Substrate
Meas. Tech.
ChEMBL_1577526 (CHEMBL3806935)
IC50
35±n/a nM
Citation
 Ai, TWilson, DJMore, SSXie, JChen, L 5-((3-Amidobenzyl)oxy)nicotinamides as Sirtuin 2 Inhibitors. J Med Chem 59:2928-41 (2016)  
Target
Name:
NAD-dependent protein deacetylase sirtuin-2
Synonyms:
NAD-Dependent Deacetylase Sirtuin-2 NAD-dependent deacetylase sirtuin 3 SIR2-like SIR2L SIR2_HUMAN Sirtuin 2 (SIRT2)
Type:
Hydrolase
Mol. Mass.:
43172.62
Organism:
Homo sapiens (Human)
Description:
Residue:
389
  
Inhibitor
Name:
BDBM50168736
Synonyms:
CHEMBL3805740
Type:
Small organic molecule
Emp. Form.:
C22H18N4O3
Mol. Mass.:
386.4033
SMILES:
NC(=O)c1cncc(OCc2cccc(NC(=O)c3ccc4cc[nH]c4c3)c2)c1
: