Target
Cyclin-C
Ligand
BDBM50169083
Substrate
Meas. Tech.
ChEMBL_1577630 (CHEMBL3807238)
IC50
5.5±n/a nM
Citation
 Koehler, MFBergeron, PBlackwood, EMBowman, KClark, KRFirestein, RKiefer, JRMaskos, KMcCleland, MLOrren, LSalphati, LSchmidt, SSchneider, EVWu, JBeresini, MH Development of a Potent, Specific CDK8 Kinase Inhibitor Which Phenocopies CDK8/19 Knockout Cells. ACS Med Chem Lett 7:223-8 (2016)  
Target
Name:
Cyclin-C
Synonyms:
CCNC Cyclin C hSRB11
Type:
PROTEIN
Mol. Mass.:
33244.88
Organism:
Homo sapiens (Human)
Description:
ChEMBL_107900
Residue:
283
  
Inhibitor
Name:
BDBM50169083
Synonyms:
CHEMBL3805667
Type:
Small organic molecule
Emp. Form.:
C14H8FN5OS
Mol. Mass.:
313.31
SMILES:
Fc1ccc(Oc2cncc3sc(cc23)-c2nnn[nH]2)cc1
: