Target
Cytochrome P450 3A4
Ligand
BDBM50169351
Substrate
Meas. Tech.
ChEMBL_1577990 (CHEMBL3806689)
IC50
>20000±n/a nM
Citation
 Wu, YJGuernon, JYang, FSnyder, LShi, JMcclure, ARajamani, RPark, HNg, ALewis, HChang, CCamac, DToyn, JHAhlijanian, MKAlbright, CFMacor, JEThompson, LA Targeting the BACE1 Active Site Flap Leads to a Potent Inhibitor That Elicits Robust Brain Aß Reduction in Rodents. ACS Med Chem Lett 7:271-6 (2016)  
Target
Name:
Cytochrome P450 3A4
Synonyms:
Albendazole monooxygenase CP3A4_HUMAN CYP3A4 CYPIIIA4 Cytochrome P450 3A4 (CYP3A4) Nifedipine oxidase Taurochenodeoxycholate 6-alpha-hydroxylase
Type:
Enzyme
Mol. Mass.:
57349.57
Organism:
Homo sapiens (Human)
Description:
Residue:
503
  
Inhibitor
Name:
BDBM50169351
Synonyms:
CHEMBL3805852
Type:
Small organic molecule
Emp. Form.:
C22H22F2N6O3S
Mol. Mass.:
488.51
SMILES:
COc1cnc(cn1)C(=O)Nc1cc(F)c(F)c(c1)[C@]1(C)C[C@H](SC(N)=N1)c1c(C)noc1C
: