Target
Metabotropic glutamate receptor 5
Ligand
BDBM50169541
Substrate
Meas. Tech.
ChEMBL_1578238 (CHEMBL3807502)
EC50
>30000±n/a nM
Citation
 Yang, FSnyder, LBBalakrishnan, ABrown, JMSivarao, DVEaston, AFernandes, AGulianello, MHanumegowda, UMHuang, HHuang, YJones, KMLi, YWMatchett, MMattson, GMiller, RSantone, KSSenapati, AShields, EESimutis, FJWestphal, RWhiterock, VJBronson, JJMacor, JEDegnan, AP Discovery and Preclinical Evaluation of BMS-955829, a Potent Positive Allosteric Modulator of mGluR5. ACS Med Chem Lett 7:289-93 (2016)  
Target
Name:
Metabotropic glutamate receptor 5
Synonyms:
GPRC1E GRM5_HUMAN metabotropic glutamate 5 | metabotropic glutamate 5a
Type:
Enzyme
Mol. Mass.:
132484.72
Organism:
Homo sapiens (Human)
Description:
Residue:
1212
  
Inhibitor
Name:
BDBM50169541
Synonyms:
CHEMBL3805542
Type:
Small organic molecule
Emp. Form.:
C22H15FN2O2
Mol. Mass.:
358.3651
SMILES:
Fc1cccc(c1)[C@H]1OC(=O)N[C@@H]1c1cncc(c1)C#Cc1ccccc1
: