Target
Cyclin-A2/Cyclin-dependent kinase 2
Ligand
BDBM158154
Substrate
Meas. Tech.
ChEMBL_1577168 (CHEMBL3807430)
IC50
>1000±n/a nM
Citation
 Menichincheri, MArdini, EMagnaghi, PAvanzi, NBanfi, PBossi, RBuffa, LCanevari, GCeriani, LColombo, MCorti, LDonati, DFasolini, MFelder, EFiorelli, CFiorentini, FGalvani, AIsacchi, ABorgia, ALMarchionni, CNesi, MOrrenius, CPanzeri, APesenti, ERusconi, LSaccardo, MBVanotti, EPerrone, EOrsini, P Discovery of Entrectinib: A New 3-Aminoindazole As a Potent Anaplastic Lymphoma Kinase (ALK), c-ros Oncogene 1 Kinase (ROS1), and Pan-Tropomyosin Receptor Kinases (Pan-TRKs) inhibitor. J Med Chem 59:3392-408 (2016)  
Target
Name:
Cyclin-A2/Cyclin-dependent kinase 2
Synonyms:
CDK2-CyclinA CDK2/Cyclin A Cyclin A2/dependent kinase 2 Cyclin-Dependent Kinase 2 (CDK2A)
Type:
Protein Complex
Mol. Mass.:
Description:
Cdk2/Cyclin A kinase was purified from insect cells coinfected with Cyclin A/Cdk2 baculovirus.
Components:
This complex has 2 components.
Component 1
Name:
Cyclin-dependent kinase 2
Synonyms:
CDK2 CDK2_HUMAN Cell division protein kinase 2 Protein cereblon/Cyclin-dependent kinase 2 | p33 protein kinase
Type:
Enzyme Subunit
Mol. Mass.:
33938.17
Organism:
Homo sapiens (Human)
Description:
P24941
Residue:
298
  
Component 2
Name:
Cyclin-A2
Synonyms:
CCN1 CCNA1 CCNA2_HUMAN Cyclin-A
Type:
Enzyme Subunit
Mol. Mass.:
48550.19
Organism:
Homo sapiens (Human)
Description:
P20248
Residue:
432
  
Inhibitor
Name:
BDBM158154
Synonyms:
US10081622, Compound 11 US11059827, Compound Entrectinib US9029356, 11 US9616059, 11
Type:
Small organic molecule
Emp. Form.:
C31H34F2N6O2
Mol. Mass.:
560.6375
SMILES:
CN1CCN(CC1)c1ccc(C(=O)Nc2n[nH]c3ccc(Cc4cc(F)cc(F)c4)cc23)c(NC2CCOCC2)c1
: