Target
Aminopeptidase N
Ligand
BDBM50170898
Substrate
Meas. Tech.
ChEMBL_1577953 (CHEMBL3806577)
Ki
5740±n/a nM
Citation
 Weglarz-Tomczak, EBerlicki, LPawelczak, MNocek, BJoachimiak, AMucha, A A structural insight into the P1S1 binding mode of diaminoethylphosphonic and phosphinic acids, selective inhibitors of alanine aminopeptidases. Eur J Med Chem 117:187-96 (2016)  
Target
Name:
Aminopeptidase N
Synonyms:
AMPN_HUMAN APN Aminopeptidase CD_antigen=CD13 Myeloid plasma membrane glycoprotein CD13 gp150 | hAPN
Type:
PROTEIN
Mol. Mass.:
109522.63
Organism:
Homo sapiens (Human)
Description:
ChEMBL_1507526
Residue:
967
  
Inhibitor
Name:
BDBM50170898
Synonyms:
CHEMBL3805964
Type:
Small organic molecule
Emp. Form.:
C6H18N3O3P
Mol. Mass.:
211.1992
SMILES:
CN(C)CCNCC(N)P(O)(O)=O
: