Target
Dipeptidyl peptidase 4
Ligand
BDBM50170927
Substrate
Meas. Tech.
ChEMBL_1578293 (CHEMBL3807661)
IC50
0.700000±n/a nM
Citation
 Cox, JMChu, HDKuethe, JTGao, YDScapin, GEiermann, GHe, HLi, XLyons, KAMetzger, JPetrov, AWu, JKXu, SSinha-Roy, RWeber, AEBiftu, T The discovery of novel 5,6,5- and 5,5,6-tricyclic pyrrolidines as potent and selective DPP-4 inhibitors. Bioorg Med Chem Lett 26:2622-6 (2016)  
Target
Name:
Dipeptidyl peptidase 4
Synonyms:
ADABP Adenosine deaminase complexing protein 2 CD_antigen=CD26 DPP4 DPPIV Dipeptidyl peptidase 4 (DPP IV) Dipeptidyl peptidase 4 (DPP4) Dipeptidyl peptidase 4 membrane form Dipeptidyl peptidase IV Dipeptidyl peptidase IV (DDP-IV) Dipeptidyl peptidase IV membrane form Dipeptidyl peptidase-IV (DPP-4) T-cell activation antigen CD26 | TP103
Type:
Enzyme
Mol. Mass.:
88271.01
Organism:
Homo sapiens (Human)
Description:
P27487
Residue:
766
  
Inhibitor
Name:
BDBM50170927
Synonyms:
CHEMBL3806216
Type:
Small organic molecule
Emp. Form.:
C19H19F2N5O
Mol. Mass.:
371.3839
SMILES:
N[C@H]1C[C@H](CO[C@@H]1c1cc(F)ccc1F)N1Cc2nn3cccnc3c2C1
: