Target
Beta-secretase 1
Ligand
BDBM50172103
Substrate
Meas. Tech.
ChEMBL_1578519 (CHEMBL3811214)
Kd
140±n/a nM
Citation
 Jordan, JBWhittington, DABartberger, MDSickmier, EAChen, KCheng, YJudd, T Fragment-Linking Approach Using (19)F NMR Spectroscopy To Obtain Highly Potent and Selective Inhibitors of฿-Secretase. J Med Chem 59:3732-49 (2016)  
Target
Name:
Beta-secretase 1
Synonyms:
ASP2 Aspartyl protease 2 BACE1 Beta-secretase (BACE) Beta-secretase 1 (BACE 1) Beta-secretase 1 (BACE1) Beta-site amyloid precursor protein cleaving enzyme 1 Memapsin-2 beta-Secretase (BACE-1) | beta-Secretase (BACE1)
Type:
Protein
Mol. Mass.:
55755.10
Organism:
Homo sapiens (Human)
Description:
P56817
Residue:
501
  
Inhibitor
Name:
BDBM50172103
Synonyms:
CHEMBL3808672
Type:
Small organic molecule
Emp. Form.:
C25H31N3O
Mol. Mass.:
389.5331
SMILES:
Cc1ccccc1-c1ccc2nc(N)c(CCC(=O)NCCC(C)(C)C)cc2c1
: