Target
Bromodomain adjacent to zinc finger domain protein 2B
Ligand
BDBM50172115
Substrate
Meas. Tech.
ChEMBL_1579116 (CHEMBL3811644)
Kd
23000±n/a nM
Citation
 Unzue, AZhao, HLolli, GDong, JZhu, JZechner, MDolbois, ACaflisch, ANevado, C The"Gatekeeper" Residue Influences the Mode of Binding of Acetyl Indoles to Bromodomains. J Med Chem 59:3087-97 (2016)  
Target
Name:
Bromodomain adjacent to zinc finger domain protein 2B
Synonyms:
BAZ2B KIAA1476 | hWALp4
Type:
PROTEIN
Mol. Mass.:
240455.43
Organism:
Homo sapiens (Human)
Description:
ChEMBL_1498197
Residue:
2168
  
Inhibitor
Name:
BDBM50172115
Synonyms:
CHEMBL3810055
Type:
Small organic molecule
Emp. Form.:
C19H18N2O3
Mol. Mass.:
322.3578
SMILES:
CC(=O)N(c1cn(C(C)=O)c2ccccc12)c1cc(O)ccc1C
: