Target
Apelin receptor
Ligand
BDBM50172376
Substrate
Meas. Tech.
ChEMBL_1579548 (CHEMBL3810894)
Ki
3.4±n/a nM
Citation
 Murza, ASainsily, XCoquerel, DCôté, JMarx, PBesserer-Offroy, ÉLongpré, JMLainé, JReversade, BSalvail, DLeduc, RDumaine, RLesur, OAuger-Messier, MSarret, PMarsault, É Discovery and Structure-Activity Relationship of a Bioactive Fragment of ELABELA that Modulates Vascular and Cardiac Functions. J Med Chem 59:2962-72 (2016)  
Target
Name:
Apelin receptor
Synonyms:
AGTRL1 APJ_HUMAN Angiotensin receptor-like 1 Apelin receptor (APJ) G-protein coupled receptor HG11
Type:
Enzyme Catalytic Domain
Mol. Mass.:
42664.06
Organism:
Homo sapiens (Human)
Description:
P35414
Residue:
380
  
Inhibitor
Name:
BDBM50172376
Synonyms:
CHEMBL3810012
Type:
Small organic molecule
Emp. Form.:
C73H115N25O17S
Mol. Mass.:
1646.917
SMILES:
CC(C)C[C@H](NC(=O)[C@@H]1CCCN1C(=O)[C@H](C)NC(=O)[C@H](CS)NC(=O)[C@H](CCCNC(N)=N)NC(=O)[C@H](CCCNC(N)=N)NC(=O)C1CCC(=O)N1)C(=O)N[C@@H](Cc1cnc[nH]1)C(=O)N[C@@H](CO)C(=O)N[C@@H](CCCNC(N)=N)C(=O)N[C@@H](C(C)C)C(=O)N1CCC[C@H]1C(=O)N[C@@H](Cc1ccccc1)C(=O)N1CCC[C@H]1C(O)=O
: