Target
Sodium/nucleoside cotransporter 2
Ligand
BDBM50172392
Substrate
Meas. Tech.
ChEMBL_1579902 (CHEMBL3813158)
IC50
62±n/a nM
Citation
 Tatani, KHiratochi, MKikuchi, NKuramochi, YWatanabe, SYamauchi, YItoh, FIsaji, MShuto, S Identification of Adenine and Benzimidazole Nucleosides as Potent Human Concentrative Nucleoside Transporter 2 Inhibitors: Potential Treatment for Hyperuricemia and Gout. J Med Chem 59:3719-31 (2016)  
Target
Name:
Sodium/nucleoside cotransporter 2
Synonyms:
CNT2 SLC28A2
Type:
PROTEIN
Mol. Mass.:
71934.06
Organism:
Homo sapiens (Human)
Description:
ChEMBL_1477251
Residue:
658
  
Inhibitor
Name:
BDBM50172392
Synonyms:
CHEMBL3808747
Type:
Small organic molecule
Emp. Form.:
C29H33N3O6
Mol. Mass.:
519.5888
SMILES:
OCCCCOc1cc(CNc2nc3ccccc3n2[C@@H]2O[C@H](CO)[C@@H](O)[C@H]2O)ccc1-c1ccccc1
: